BDBM530513 WO2022076764, Example 42
SMILES COc1cc(F)c(c(F)c1)-n1cc(nc1NC(=O)c1ccc(OC(F)F)cc1)C(F)(F)C(F)(F)F
InChI Key InChIKey=JGNAXYZLLDCRFH-UHFFFAOYSA-N
Data  2 EC50
  Tab Delimited (TSV)   2D SDfile   Computed 3D by Vconf -m prep SDfile
Find this compound or compounds like it in BindingDB:
Activity Spreadsheet -- Enzyme Inhibition Constant Data from BindingDB
Found 1 hit for monomerid = 530513
TargetN-formyl peptide receptor 2(Homo sapiens (Human))
Bristol-Myers Squibb
WIPO
LigandPNGBDBM530513(WO2022076764, Example 42)
Affinity DataEC50:  57nM
Ligand InfoPC cidPC sid
In DepthDetails PubMed